{"text_format":"1","workbook":"xlsx","n_sheets":2,"sheets":["A","1880-2002"],"not_rendered":{"charts":6,"images":0,"macros":1,"external_links":0,"defined_names":0,"comments":0,"pivot_tables":0},"unopened":[],"bounds":{"document_bytes":16777216,"sheet_cells":100000,"rows_first":2000,"rows_last":500,"rows_between":2000,"halvings":0,"cell_chars":16384,"cell_head_chars":4096},"cells_cut":0,"cells_raw":0,"read":"whole","date_system":"1900"}

{"sheet":"A","index":0,"n_rows":46,"n_cols":21,"rows_kept":46,"cut":false,"hidden":false,"merged":[[44,15,44,21],[45,15,45,21],[3,7,4,8],[1,1,2,14],[1,15,1,21],[2,15,2,21]]}
[]
[null,"INTEREST RATE HISTORY",null,null,null,null,null,null,null,null,null,null,null,null,null,"Copyright 2003-2018, Crestmont Research"]
[null,null,null,null,null,null,null,null,null,null,null,null,null,null,null,"(www.CrestmontResearch.com)"]
[null,"Speed ( 1 - 10 )",null,1,null,null,null,{"$f":"'1880-2002'!A148","v":1950},null,null,null,null,null,null,null,null,"1-Yr","20-Yr","CPI","GDP-R","DJIA"]
[null,{"$f":"IF('1880-2002'!O2=TRUE,\"MODEL IN MANUAL MODE\",\"( 1=Fast/10=Slow)\")","v":"MODEL IN MANUAL MODE"},null,null,null,null,null,null,null,null,null,null,null,null,null,null,{"$f":"VLOOKUP($H$4,'1880-2002'!$A$3:$D$144,2)","v":1.3500000000000002E-2},{"$f":"VLOOKUP($H$4,'1880-2002'!$A$3:$D$144,3)","v":2.3700000000000002E-2},{"$f":"VLOOKUP($H$4,'1880-2002'!$A$3:$F$144,5)","v":1.2605042016806678E-2},{"$f":"VLOOKUP($H$4,'1880-2002'!$A$3:$F$144,6)","v":8.7162128528050165E-2},{"$f":"VLOOKUP($H$4,'1880-2002'!$A$3:$D$144,4)","v":0.17404747656094144}]
[]
[]
[]
[]
[]
[]
[]
[]
[]
[]
[]
[]
[]
[]
[]
[]
[]
[]
[]
[]
[]
[]
[]
[]
[]
[]
[]
[]
[]
[]
[]
[]
[]
[]
[]
[]
[]
[]
[]
[null,null,null,null,null,null,null,null,null,null,null,null,null,null,null,"Automatic Operation: Uncheck \"Manual\". enter \"Speed\", then press \"START\""]
[null,"Manual",null,null,null,null,null,null,null,null,null,null,null,null,null,"Manual Operation: Select \"Manual\", then use slide bar or click with the mouse"]

{"sheet":"1880-2002","index":1,"n_rows":311,"n_cols":25,"rows_kept":311,"cut":false,"hidden":true,"merged":[]}
[null,null,null,null,null,null,null,null,null,null,null,null,null,null,null,null,null,null,null,null,null,null,null,">> start by insert row (L140 & L285) and copy down…then,"]
["Year","1-Year","20-Year","DJIA","CPI","GDP-R",null,"Year","1-Year","20-Year","DJIA","CPI","GDP-R",null,true,"manual",null,null,null,null,null,null,null,"1. update annual data from Interest Rate file & Master Data"]
[1880,5.2300000000000006E-2,3.6499999999999998E-2,null,0.11906956842457639,0.11779041429731918,null,{"$f":"IF($A3<=$A$148,$A3,\" \")","v":1880},{"$f":"IF($A3<=$A$148,B3,\" \")","v":5.2300000000000006E-2},{"$f":"IF($A3<=$A$148,C3,\" \")","v":3.6499999999999998E-2},{"$f":"IF($A3<=$A$148,D3,\" \")","v":0},{"$f":"IF($A3<=$A$148,E3,\" \")","v":0.11906956842457639},{"$f":"IF($A3<=$A$148,F3,\" \")","v":0.11779041429731918},null,null,null,null,null,null,null,null,null,null,"2. Increase end year for the additional year [S7]"]
[1881,5.3600000000000002E-2,3.3500000000000002E-2,null,2.4938580542360533E-2,3.5610465116279189E-2,null,1881,5.3600000000000002E-2,3.3500000000000002E-2,0,2.4938580542360533E-2,3.5610465116279189E-2,null,null,null,null,null,null,null,null,null,null,"3. increase the Slide Control value (Format Control in slide control)"]
[1882,5.6399999999999999E-2,3.2400000000000005E-2,null,5.4339181174897444E-2,6.385964912280695E-2,null,1882,5.6399999999999999E-2,3.2400000000000005E-2,0,5.4339181174897444E-2,6.385964912280695E-2,null,null,null,null,null,null,null,null,null,null,"4. change formula in row 145 (looks to change automatically with insert/copy)"]
[1883,5.62E-2,3.2099999999999997E-2,null,-7.2308200952722057E-2,2.4406332453825952E-2,null,1883,5.62E-2,3.2099999999999997E-2,0,-7.2308200952722057E-2,2.4406332453825952E-2,null,null,null,null,null,null,null,null,null,null,"5. change copyright date"]
[1884,5.21E-2,3.1800000000000002E-2,null,-7.7944206423229079E-2,1.8029620090147969E-2,null,1884,5.21E-2,3.1800000000000002E-2,0,-7.7944206423229079E-2,1.8029620090147969E-2,null,null,null,null,"END YR",2017]
[1885,4.0500000000000001E-2,3.0600000000000002E-2,null,-8.2732680655582036E-2,7.5901328273246804E-3,null,1885,4.0500000000000001E-2,3.0600000000000002E-2,0,-8.2732680655582036E-2,7.5901328273246804E-3,null,null,null,null,"START YR",1900]
[1886,4.7699999999999992E-2,3.0499999999999999E-2,null,-4.1176950196964324E-2,3.0131826741996104E-2,null,1886,4.7699999999999992E-2,3.0499999999999999E-2,0,-4.1176950196964324E-2,3.0131826741996104E-2,null,null,null,null,"Speed",{"$f":"A!D4/10","v":0.1}]
[1887,5.7300000000000004E-2,3.0299999999999997E-2,null,3.6810200931111314E-2,4.5094454600853151E-2,null,1887,5.7300000000000004E-2,3.0299999999999997E-2,0,3.6810200931111314E-2,4.5094454600853151E-2,null,null,null,null,"MANUAL","MACRO"]
[1888,4.9100000000000005E-2,3.0200000000000001E-2,null,1.7751784311234253E-2,-4.6647230320699951E-3,null,1888,4.9100000000000005E-2,3.0200000000000001E-2,0,1.7751784311234253E-2,-4.6647230320699951E-3,null,null,null,null,1950,1900,null,"<< make this 1950 and 1900 before saving workbook"]
[1889,4.8499999999999995E-2,3.0299999999999997E-2,null,-5.426410620635258E-2,6.20972466315175E-2,null,1889,4.8499999999999995E-2,3.0299999999999997E-2,0,-5.426410620635258E-2,6.20972466315175E-2]
[1890,5.62E-2,3.15E-2,null,7.1722175710469127E-3,1.4340871483728534E-2,null,1890,5.62E-2,3.15E-2,0,7.1722175710469127E-3,1.4340871483728534E-2]
[1891,5.4600000000000003E-2,3.27E-2,null,-3.0519927412326897E-3,3.2626427406198921E-2,null,1891,5.4600000000000003E-2,3.27E-2,0,-3.0519927412326897E-3,3.2626427406198921E-2]
[1892,4.0999999999999995E-2,3.3500000000000002E-2,null,-6.428579555495062E-2,4.6866771985255351E-2,null,1892,4.0999999999999995E-2,3.3500000000000002E-2,0,-6.428579555495062E-2,4.6866771985255351E-2]
[1893,6.7799999999999999E-2,3.4500000000000003E-2,null,2.3991501343263666E-2,-5.0301810865205354E-4,null,1893,6.7799999999999999E-2,3.4500000000000003E-2,0,2.3991501343263666E-2,-5.0301810865205354E-4]
[1894,3.04E-2,3.4000000000000002E-2,null,-0.10543114424262423,-2.9189733266230422E-2,null,1894,3.04E-2,3.4000000000000002E-2,0,-0.10543114424262423,-2.9189733266230422E-2,null,null,null,null,"NOTES"]
[1895,2.8300000000000002E-2,3.4500000000000003E-2,null,2.142833111729292E-2,0.11715914981855891,null,1895,2.8300000000000002E-2,3.4500000000000003E-2,0,2.142833111729292E-2,0.11715914981855891,null,null,null,null,0.9,"Large format",null,null,"i-rate-history7"]
[1896,5.8200000000000002E-2,3.6699999999999997E-2,null,-5.0116484914680792E-2,-2.2737819025522077E-2,null,1896,5.8200000000000002E-2,3.6699999999999997E-2,0,-5.0116484914680792E-2,-2.2737819025522077E-2,null,null,null,null,0.5,"Small format",null,null,"i-rate-history7-s"]
[1897,3.5000000000000003E-2,3.4300000000000004E-2,0.22150803461063018,4.9079444428523633E-3,8.1671415004748393E-2,null,1897,3.5000000000000003E-2,3.4300000000000004E-2,0.22150803461063018,4.9079444428523633E-3,8.1671415004748393E-2,null,null,null,null,0.7,"Medium",null,null,"i-rate-history7-m"]
[1898,3.8300000000000001E-2,3.4700000000000002E-2,0.22485326856911581,3.9072105154458692E-2,2.3705004389815487E-2,null,1898,3.8300000000000001E-2,3.4700000000000002E-2,0.22485326856911581,3.9072105154458692E-2,2.3705004389815487E-2]
[1899,4.1500000000000002E-2,3.4300000000000004E-2,8.6087243886318499E-2,7.9905885574143465E-2,0.11620926243567764,null,1899,4.1500000000000002E-2,3.4300000000000004E-2,8.6087243886318499E-2,7.9905885574143465E-2,0.11620926243567764,null,null,null,null,"use this version; save as other version with protection"]
[1900,3.2300000000000002E-2,2.895E-2,7.5764491099954201E-2,7.1817021448358886E-2,1.959277756434874E-2,null,1900,3.2300000000000002E-2,2.895E-2,7.5764491099954201E-2,7.1817021448358886E-2,1.959277756434874E-2]
[1901,2.8999999999999998E-2,2.895E-2,-8.6974968179889589E-2,-1.5228376820452971E-2,0.12245666917859843,null,1901,2.8999999999999998E-2,2.895E-2,-8.6974968179889589E-2,-1.5228376820452971E-2,0.12245666917859843,null,null,null,">","set manual to 1950"]
[1902,0.03,2.9950000000000001E-2,-4.1821561338288848E-3,6.391722088476981E-2,1.7119838872104776E-2,null,1902,0.03,2.9950000000000001E-2,-4.1821561338288848E-3,6.391722088476981E-2,1.7119838872104776E-2,null,null,null,">","put cursor in A1; shift worksheet over one and down one (have not shifted last few years)"]
[1903,3.15E-2,3.1449999999999999E-2,-0.23611759216052275,1.2597609071926863E-2,2.8712871287128738E-2,null,1903,3.15E-2,3.1449999999999999E-2,-0.23611759216052275,1.2597609071926863E-2,2.8712871287128738E-2]
[1904,3.1699999999999999E-2,3.1699999999999999E-2,0.42638973732437391,-9.5762391667075786E-4,3.7856913699069628E-2,null,1904,3.1699999999999999E-2,3.1699999999999999E-2,0.42638973732437391,-9.5762391667075786E-4,3.7856913699069628E-2,null,null,null,0,"save as large version name"]
[1905,3.7499999999999999E-2,3.1449999999999999E-2,0.37844396859386165,9.5795477974038867E-3,9.1808346213292147E-2,null,1905,3.7499999999999999E-2,3.1449999999999999E-2,0.37844396859386165,9.5795477974038867E-3,9.1808346213292147E-2,null,null,null,1,"protect sheet 2",null,"#std123#"]
[1906,4.4299999999999999E-2,3.295E-2,-2.2887323943662108E-2,2.5613897653378181E-2,4.1053227633069067E-2,null,1906,4.4299999999999999E-2,3.295E-2,-2.2887323943662108E-2,2.5613897653378181E-2,4.1053227633069067E-2,null,null,null,2,"right click / sheet hide"]
[1907,4.6100000000000002E-2,3.4950000000000002E-2,-0.3773184949655537,5.8279720569072158E-2,-1.550176774544465E-2,null,1907,4.6100000000000002E-2,3.4950000000000002E-2,-0.3773184949655537,5.8279720569072158E-2,-1.550176774544465E-2,null,null,null,3,"protect sheet 1",null,"%std987%"]
[1908,4.1900000000000007E-2,3.5049999999999998E-2,0.4663829787234044,-3.6711262574052994E-2,-5.4696132596685154E-2,null,1908,4.1900000000000007E-2,3.5049999999999998E-2,0.4663829787234044,-3.6711262574052994E-2,-5.4696132596685154E-2,null,null,null,4,"protect workbook",null,"$std555$",null,"structure only",null,null,"(in REVIEW tab)"]
[1909,3.7599999999999995E-2,3.465E-2,0.14973882762623325,7.9854285132565872E-2,0.11659848042080667,null,1909,3.7599999999999995E-2,3.465E-2,0.14973882762623325,7.9854285132565872E-2,0.11659848042080667,null,null,null,5,"change % size and save as other names (seems to work in 2016; no need to redo all protections for each version)"]
[1910,3.7900000000000003E-2,3.5249999999999997E-2,-0.1780918727915195,3.5294260797717358E-2,4.4490970950012976E-3,null,1910,3.7900000000000003E-2,3.5249999999999997E-2,-0.1780918727915195,3.5294260797717358E-2,4.4490970950012976E-3]
[1911,3.6900000000000002E-2,3.1400000000000004E-2,2.0881955533718077E-3,-7.792228438968396E-2,3.1787389265242272E-2,null,1911,3.6900000000000002E-2,3.1400000000000004E-2,2.0881955533718077E-3,-7.792228438968396E-2,3.1787389265242272E-2]
[1912,4.0099999999999997E-2,3.1800000000000002E-2,7.710223093895574E-2,6.6019794348002536E-2,5.7828282828282784E-2,null,{"$f":"IF($A35<=$A$148,$A35,\" \")","v":1912},{"$f":"IF($A35<=$A$148,B35,\" \")","v":4.0099999999999997E-2},{"$f":"IF($A35<=$A$148,C35,\" \")","v":3.1800000000000002E-2},{"$f":"IF($A35<=$A$148,D35,\" \")","v":7.710223093895574E-2},{"$f":"IF($A35<=$A$148,E35,\" \")","v":6.6019794348002536E-2},{"$f":"IF($A35<=$A$148,F35,\" \")","v":5.7828282828282784E-2},null,null,null,null,"http://www.federalreserve.gov/releases/H15/data.htm"]
[1913,4.3099999999999999E-2,3.7100000000000001E-2,-0.10344827586206895,2.9324538421210633E-2,3.9388875626641173E-2,null,1913,4.3099999999999999E-2,3.7100000000000001E-2,-0.10344827586206895,2.9324538421210633E-2,3.9388875626641173E-2]
[1914,4.1799999999999997E-2,3.7999999999999999E-2,-0.30718456461030719,1.0101010101010166E-2,-7.5792374827744591E-2,null,1914,4.1799999999999997E-2,3.7999999999999999E-2,-0.30718456461030719,1.0101010101010166E-2,-7.5792374827744591E-2]
[1915,3.6000000000000004E-2,3.7450000000000004E-2,0.81659948699157225,0.01,3.7027833001988197E-2,null,1915,3.6000000000000004E-2,3.7450000000000004E-2,0.81659948699157225,0.01,3.7027833001988197E-2]
[1916,3.39E-2,3.6699999999999997E-2,-4.1855774079677333E-2,7.9207920792079278E-2,0.16223340522405949,null,1916,3.39E-2,3.6699999999999997E-2,-4.1855774079677333E-2,7.9207920792079278E-2,0.16223340522405949,null,null,null,null,"2017-02-03","Added DoEvents (twice) to macro code to get graphs to update dynamically"]
[1917,4.3899999999999995E-2,4.0549999999999996E-2,-0.21705263157894739,0.17431192660550465,-2.0618556701035295E-4,null,1917,4.3899999999999995E-2,4.0549999999999996E-2,-0.21705263157894739,0.17431192660550465,-2.0618556701035295E-4,null,null,null,null,null,"https://answers.microsoft.com/en-us/msoffice/forum/msoffice_excel-msoffice_custom/excel-2016-vba-does-not-update-charts/f2b460b8-c434-45a7-8262-12dd0be8ab1f"]
[1918,5.1500000000000004E-2,4.4349999999999994E-2,0.10513578919064281,0.1796875,7.6923076923077094E-2,null,1918,5.1500000000000004E-2,4.4349999999999994E-2,0.10513578919064281,0.1796875,7.6923076923077094E-2]
[1919,5.4699999999999999E-2,4.6100000000000002E-2,0.30450121654501228,0.14569536423841067,-2.8916124090386908E-2,null,1919,5.4699999999999999E-2,4.6100000000000002E-2,0.30450121654501228,0.14569536423841067,-2.8916124090386908E-2]
[1920,6.1500000000000006E-2,4.8600000000000004E-2,-0.32901240324536041,0.15606936416184958,-2.1297574442910694E-2,null,1920,6.1500000000000006E-2,4.8600000000000004E-2,-0.32901240324536041,0.15606936416184958,-2.1297574442910694E-2]
[1921,5.7500000000000002E-2,4.7E-2,0.12300208478109798,-0.105,-3.5260930888575404E-2,null,1921,5.7500000000000002E-2,4.7E-2,0.12300208478109798,-0.105,-3.5260930888575404E-2]
[1922,4.7800000000000002E-2,4.385E-2,0.21497524752475261,-6.1452513966480327E-2,7.1846282372598269E-2,null,1922,4.7800000000000002E-2,4.385E-2,0.21497524752475261,-6.1452513966480327E-2,7.1846282372598269E-2]
[1923,4.6399999999999997E-2,4.3049999999999998E-2,-2.6993990017316949E-2,1.7857142857142794E-2,0.13990646921278249,null,1923,4.6399999999999997E-2,4.3049999999999998E-2,-2.6993990017316949E-2,1.7857142857142794E-2,0.13990646921278249]
[1924,4.0599999999999997E-2,4.215E-2,0.26162060301507539,0,2.6495726495726402E-2,null,1924,4.0599999999999997E-2,4.215E-2,0.26162060301507539,0,2.6495726495726402E-2]
[1925,3.7499999999999999E-2,4.07E-2,0.29997510580034836,2.3391812865497075E-2,2.2647793505412128E-2,null,1925,3.7499999999999999E-2,4.07E-2,0.29997510580034836,2.3391812865497075E-2,2.2647793505412128E-2]
[1926,3.9699999999999999E-2,3.9699999999999999E-2,3.4469551895823791E-3,1.1428571428571344E-2,6.0087933561309148E-2,null,1926,3.9699999999999999E-2,3.9699999999999999E-2,3.4469551895823791E-3,1.1428571428571344E-2,6.0087933561309148E-2]
[1927,3.7999999999999999E-2,3.7949999999999998E-2,0.2767175572519085,-1.6949152542372947E-2,5.5299539170508005E-3,null,1927,3.7999999999999999E-2,3.7949999999999998E-2,0.2767175572519085,-1.6949152542372947E-2,5.5299539170508005E-3]
[1928,4.2800000000000005E-2,3.8699999999999998E-2,0.49476831091180884,-1.724137931034464E-2,1.8484570730217031E-2,null,1928,4.2800000000000005E-2,3.8699999999999998E-2,0.49476831091180884,-1.724137931034464E-2,1.8484570730217031E-2]
[1929,4.4600000000000001E-2,4.045E-2,-0.1717333333333334,0,6.7612001644060893E-2,null,1929,4.4600000000000001E-2,4.045E-2,-0.1717333333333334,0,6.7612001644060893E-2]
[1930,3.3500000000000002E-2,3.8699999999999998E-2,-0.33765292981326456,-2.3391812865497186E-2,-8.5084232443687124E-2,null,1930,3.3500000000000002E-2,3.8699999999999998E-2,-0.33765292981326456,-2.3391812865497186E-2,-8.5084232443687124E-2]
[1931,3.1400000000000004E-2,4.0199999999999993E-2,-0.52667395795357885,-8.9820359281437168E-2,-6.4032274749146634E-2,null,1931,3.1400000000000004E-2,4.0199999999999993E-2,-0.52667395795357885,-8.9820359281437168E-2,-6.4032274749146634E-2]
[1932,2.92E-2,4.0250000000000001E-2,-0.22644415917843397,-9.8684210526315819E-2,-0.12886825817860292,null,1932,2.92E-2,4.0250000000000001E-2,-0.22644415917843397,-9.8684210526315819E-2,-0.12886825817860292]
[1933,2.23E-2,3.6299999999999999E-2,0.63740458015267176,-5.1094890510948843E-2,-1.2560263892413159E-2,null,1933,2.23E-2,3.6299999999999999E-2,0.63740458015267176,-5.1094890510948843E-2,-1.2560263892413159E-2]
[1934,1.46E-2,3.2599999999999997E-2,5.4423837032532729E-2,3.0769230769230882E-2,0.10779904920981642,null,1934,1.46E-2,3.2599999999999997E-2,5.4423837032532729E-2,3.0769230769230882E-2,0.10779904920981642]
[1935,4.5000000000000005E-3,2.8250000000000001E-2,0.38533256439830832,2.2388059701492491E-2,8.907446068197622E-2,null,1935,4.5000000000000005E-3,2.8250000000000001E-2,0.38533256439830832,2.2388059701492491E-2,8.907446068197622E-2]
[1936,2.7000000000000001E-3,2.5899999999999999E-2,0.2481787275376397,1.4598540145985384E-2,0.12939297124600646,null,1936,2.7000000000000001E-3,2.5899999999999999E-2,0.2481787275376397,1.4598540145985384E-2,0.12939297124600646]
[1937,3.9000000000000003E-3,2.5249999999999998E-2,-0.32823790994997226,3.5971223021582732E-2,5.1013672795851006E-2,null,1937,3.9000000000000003E-3,2.5249999999999998E-2,-0.32823790994997226,3.5971223021582732E-2,5.1013672795851006E-2]
[1938,3.3E-3,2.4E-2,0.27728589160115868,-2.083333333333337E-2,-3.3106047012380957E-2,null,1938,3.3E-3,2.4E-2,0.27728589160115868,-2.083333333333337E-2,-3.3106047012380957E-2]
[1939,1.1000000000000001E-3,2.2200000000000001E-2,-2.8310443119979323E-2,-1.4184397163120477E-2,7.9706782963718803E-2,null,1939,1.1000000000000001E-3,2.2200000000000001E-2,-2.8310443119979323E-2,-1.4184397163120477E-2,7.9706782963718803E-2]
[1940,2.9999999999999997E-4,2.145E-2,-0.12574171611440776,7.194244604316502E-3,8.8088690271570957E-2,null,1940,2.9999999999999997E-4,2.145E-2,-0.12574171611440776,7.194244604316502E-3,8.8088690271570957E-2]
[1941,2.3E-3,2.1749999999999999E-2,-0.15381682300007626,0.05,0.17707921965089657,null,1941,2.3E-3,2.1749999999999999E-2,-0.15381682300007626,0.05,0.17707921965089657]
[1942,6.0999999999999995E-3,2.23E-2,7.6063446286950276E-2,0.10884353741496611,0.188888143326847,null,1942,6.0999999999999995E-3,2.23E-2,7.6063446286950276E-2,0.10884353741496611,0.188888143326847]
[1943,7.4999999999999997E-3,2.2250000000000002E-2,0.13810720268006693,6.1349693251533832E-2,0.17039169206456695,null,1943,7.4999999999999997E-3,2.2250000000000002E-2,0.13810720268006693,6.1349693251533832E-2,0.17039169206456695]
[1944,6.7000000000000002E-3,2.1949999999999997E-2,0.11803664728824792,1.7341040462427681E-2,7.9905482953175566E-2,null,{"$f":"IF($A67<=$A$148,$A67,\" \")","v":1944},{"$f":"IF($A67<=$A$148,B67,\" \")","v":6.7000000000000002E-3},{"$f":"IF($A67<=$A$148,C67,\" \")","v":2.1949999999999997E-2},{"$f":"IF($A67<=$A$148,D67,\" \")","v":0.11803664728824792},{"$f":"IF($A67<=$A$148,E67,\" \")","v":1.7341040462427681E-2},{"$f":"IF($A67<=$A$148,F67,\" \")","v":7.9905482953175566E-2}]
[1945,5.6000000000000008E-3,2.07E-2,0.26972948068189284,2.2727272727272707E-2,-9.6454407430561773E-3,null,1945,5.6000000000000008E-3,2.07E-2,0.26972948068189284,2.2727272727272707E-2,-9.6454407430561773E-3]
[1946,5.7999999999999996E-3,1.9950000000000002E-2,-8.143693950546893E-2,8.3333333333333259E-2,-0.11583551267021375,null,1946,5.7999999999999996E-3,1.9950000000000002E-2,-8.143693950546893E-2,8.3333333333333259E-2,-0.11583551267021375]
[1947,9.4999999999999998E-3,2.1850000000000001E-2,2.2347629796839685E-2,0.14358974358974352,-1.0964353103166902E-2,null,1947,9.4999999999999998E-3,2.1850000000000001E-2,2.2347629796839685E-2,0.14358974358974352,-1.0964353103166902E-2]
[1948,1.2199999999999999E-2,2.2949999999999998E-2,-2.1307131817178138E-2,8.0717488789237679E-2,4.1559245127358979E-2,null,1948,1.2199999999999999E-2,2.2949999999999998E-2,-2.1307131817178138E-2,8.0717488789237679E-2,4.1559245127358979E-2]
[1949,1.1299999999999999E-2,2.1700000000000001E-2,0.13096446700507602,-1.2448132780083054E-2,-5.4950495049504999E-3,null,1949,1.1299999999999999E-2,2.1700000000000001E-2,0.13096446700507602,-1.2448132780083054E-2,-5.4950495049504999E-3]
[1950,1.3500000000000002E-2,2.3700000000000002E-2,0.17404747656094144,1.2605042016806678E-2,8.7162128528050165E-2,null,1950,1.3500000000000002E-2,2.3700000000000002E-2,0.17404747656094144,1.2605042016806678E-2,8.7162128528050165E-2]
[1951,1.6500000000000001E-2,2.5899999999999999E-2,0.14361566561889405,7.8838174273858863E-2,8.0586080586080522E-2,null," "," "," "," "," "," "]
[1952,1.95E-2,2.76E-2,8.4203097723136278E-2,1.9230769230769162E-2,4.072033898305083E-2,null," "," "," "," "," "," "]
[1953,1.6299999999999999E-2,2.7149999999999997E-2,-3.7684138403562883E-2,7.547169811320753E-3,4.6944342657057936E-2,null," "," "," "," "," "," "]
[1954,1.21E-2,2.69E-2,0.43962264150943398,7.4906367041198685E-3,-5.6389515439060345E-3,null," "," "," "," "," "," "]
[1955,1.8799999999999997E-2,2.7699999999999999E-2,0.20774499863992668,-3.7174721189590088E-3,7.1219054323594877E-2,null," "," "," "," "," "," "]
[1956,2.8799999999999999E-2,2.9950000000000001E-2,2.2665847665847672E-2,1.4925373134328401E-2,2.1321650237313028E-2,null," "," "," "," "," "," "]
[1957,2.63E-2,3.2349999999999997E-2,-0.12769535707850321,3.3088235294117752E-2,2.105526560377502E-2,null," "," "," "," "," "," "]
{"$rows_left_out":231}